{"text_format":"1","workbook":"xlsx","n_sheets":10,"sheets":["Base Maestra","Instructivo","Resumen de Calidad","XX.Institución-2024","Notas 2025","1.Catálogo Espacio Temporal","2.Catálgo CAI","3.Catálogo COG","4.Equivalencias COG=CFA","5.Equivalencias CAI=CFA"],"not_rendered":{"charts":0,"images":1,"macros":1,"external_links":0,"defined_names":38,"comments":2,"pivot_tables":0},"unopened":[],"bounds":{"document_bytes":16777216,"sheet_cells":100000,"rows_first":2000,"rows_last":500,"rows_between":2000,"halvings":0,"cell_chars":16384,"cell_head_chars":4096},"cells_cut":0,"cells_raw":0,"read":"whole","date_system":"1900"}

{"sheet":"Base Maestra","index":0,"n_rows":519,"n_cols":23,"rows_kept":519,"cut":false,"hidden":true,"merged":[[2,13,3,13],[2,8,2,11],[179,5,179,10],[194,5,194,10],[67,5,67,8],[2,3,2,6],[24,0,24,2],[24,5,24,8]]}
["Cuenta Pública 2024"]
["Miles de Pesos "]
[null,null,null,"Referencia de Subfunción_Cuenta Pública",null,null,null,null,"Referencia de Subfunción_Matriz de Gasto",null,null,null,null,"Fuente de Financiamiento Evaluda",null,"Penalización por días de retraso en la calificación de Oportunidad"]
["Número de Proveedor","Institución","Descripción",1,2,3,4,"Suma",1,2,3,4,"Suma",null,null,"Días hábiles de retraso","Penalización","Puntaje de oportunidad","Calificación",null,"Cve_Edo_Ins","Cve_FF_VM","Descripción"]
[33,"IMSS","Instituto Mexicano del Seguro Social",0,471886547.42000192,6764204.8999999994,0,{"$f":"SUM(D5:G5)","v":478650752.3200019},{"$f":"SUMIFS('XX.Institución-2024'!$W$1:$W$63000,'XX.Institución-2024'!$D$1:$D$63000,'Base Maestra'!$A5,'XX.Institución-2024'!$F$1:$F$63000,'Base Maestra'!I$4,'XX.Institución-2024'!$E$1:$E$63000,'Base Maestra'!$N5)","v":0},{"$f":"SUMIFS('XX.Institución-2024'!$W$1:$W$63000,'XX.Institución-2024'!$D$1:$D$63000,'Base Maestra'!$A5,'XX.Institución-2024'!$F$1:$F$63000,'Base Maestra'!J$4,'XX.Institución-2024'!$E$1:$E$63000,'Base Maestra'!$N5)","v":0},{"$f":"SUMIFS('XX.Institución-2024'!$W$1:$W$63000,'XX.Institución-2024'!$D$1:$D$63000,'Base Maestra'!$A5,'XX.Institución-2024'!$F$1:$F$63000,'Base Maestra'!K$4,'XX.Institución-2024'!$E$1:$E$63000,'Base Maestra'!$N5)","v":0},{"$f":"SUMIFS('XX.Institución-2024'!$W$1:$W$63000,'XX.Institución-2024'!$D$1:$D$63000,'Base Maestra'!$A5,'XX.Institución-2024'!$F$1:$F$63000,'Base Maestra'!L$4,'XX.Institución-2024'!$E$1:$E$63000,'Base Maestra'!$N5)","v":0},{"$f":"SUM(I5:L5)","v":0},"A08",null,0,0,1,100,null,37,"A01","Ramo 07 (SEDENA)"]
[34,"ISSSTE","Instituto de Seguridad y Servicios Sociales de los Trabajadores del Estado",0,93088093.249999791,0,0,{"$f":"SUM(D6:G6)","v":93088093.249999791},{"$f":"SUMIFS('XX.Institución-2024'!$W$1:$W$63000,'XX.Institución-2024'!$D$1:$D$63000,'Base Maestra'!$A6,'XX.Institución-2024'!$F$1:$F$63000,'Base Maestra'!I$4,'XX.Institución-2024'!$E$1:$E$63000,'Base Maestra'!$N6)","v":0},{"$f":"SUMIFS('XX.Institución-2024'!$W$1:$W$63000,'XX.Institución-2024'!$D$1:$D$63000,'Base Maestra'!$A6,'XX.Institución-2024'!$F$1:$F$63000,'Base Maestra'!J$4,'XX.Institución-2024'!$E$1:$E$63000,'Base Maestra'!$N6)","v":0},{"$f":"SUMIFS('XX.Institución-2024'!$W$1:$W$63000,'XX.Institución-2024'!$D$1:$D$63000,'Base Maestra'!$A6,'XX.Institución-2024'!$F$1:$F$63000,'Base Maestra'!K$4,'XX.Institución-2024'!$E$1:$E$63000,'Base Maestra'!$N6)","v":0},{"$f":"SUMIFS('XX.Institución-2024'!$W$1:$W$63000,'XX.Institución-2024'!$D$1:$D$63000,'Base Maestra'!$A6,'XX.Institución-2024'!$F$1:$F$63000,'Base Maestra'!L$4,'XX.Institución-2024'!$E$1:$E$63000,'Base Maestra'!$N6)","v":0},{"$f":"SUM(I6:L6)","v":0},"A07",null,1,0.05,0.95,95,null,38,"A03","Ramo 13 (SEMAR)"]
[35,"PEMEX","Petroleos Mexicanos",0,17922541.200000003,0,0,17922541.200000003,{"$f":"SUMIFS('XX.Institución-2024'!$W$1:$W$63000,'XX.Institución-2024'!$D$1:$D$63000,'Base Maestra'!$A7,'XX.Institución-2024'!$F$1:$F$63000,'Base Maestra'!I$4,'XX.Institución-2024'!$E$1:$E$63000,'Base Maestra'!$N7)","v":0},{"$f":"SUMIFS('XX.Institución-2024'!$W$1:$W$63000,'XX.Institución-2024'!$D$1:$D$63000,'Base Maestra'!$A7,'XX.Institución-2024'!$F$1:$F$63000,'Base Maestra'!J$4,'XX.Institución-2024'!$E$1:$E$63000,'Base Maestra'!$N7)","v":0},{"$f":"SUMIFS('XX.Institución-2024'!$W$1:$W$63000,'XX.Institución-2024'!$D$1:$D$63000,'Base Maestra'!$A7,'XX.Institución-2024'!$F$1:$F$63000,'Base Maestra'!K$4,'XX.Institución-2024'!$E$1:$E$63000,'Base Maestra'!$N7)","v":0},{"$f":"SUMIFS('XX.Institución-2024'!$W$1:$W$63000,'XX.Institución-2024'!$D$1:$D$63000,'Base Maestra'!$A7,'XX.Institución-2024'!$F$1:$F$63000,'Base Maestra'!L$4,'XX.Institución-2024'!$E$1:$E$63000,'Base Maestra'!$N7)","v":0},{"$f":"SUM(I7:L7)","v":0},"A09",null,2,0.1,0.9,90,null,36,"A04","Ramo 19 (IMSS-BIENESTAR)"]
[36,"IMSS-Bienestar","Programa IMSS-Bienestar",0,19584685,0,0,19584685,{"$f":"SUMIFS('XX.Institución-2024'!$W$1:$W$63000,'XX.Institución-2024'!$D$1:$D$63000,'Base Maestra'!$A8,'XX.Institución-2024'!$F$1:$F$63000,'Base Maestra'!I$4,'XX.Institución-2024'!$E$1:$E$63000,'Base Maestra'!$N8)","v":0},{"$f":"SUMIFS('XX.Institución-2024'!$W$1:$W$63000,'XX.Institución-2024'!$D$1:$D$63000,'Base Maestra'!$A8,'XX.Institución-2024'!$F$1:$F$63000,'Base Maestra'!J$4,'XX.Institución-2024'!$E$1:$E$63000,'Base Maestra'!$N8)","v":0},{"$f":"SUMIFS('XX.Institución-2024'!$W$1:$W$63000,'XX.Institución-2024'!$D$1:$D$63000,'Base Maestra'!$A8,'XX.Institución-2024'!$F$1:$F$63000,'Base Maestra'!K$4,'XX.Institución-2024'!$E$1:$E$63000,'Base Maestra'!$N8)","v":0},{"$f":"SUMIFS('XX.Institución-2024'!$W$1:$W$63000,'XX.Institución-2024'!$D$1:$D$63000,'Base Maestra'!$A8,'XX.Institución-2024'!$F$1:$F$63000,'Base Maestra'!L$4,'XX.Institución-2024'!$E$1:$E$63000,'Base Maestra'!$N8)","v":0},0,"A04",null,3,0.15,0.85,85,null,34,"A07","Instituto de Seguridad y Servicios Sociales de los Trabajadores del Estado (ISSSTE)"]
[37,"SEDENA","Secretaria de la Defensa Nacional",0,8783561.959999999,0,0,8783561.959999999,{"$f":"SUMIFS('XX.Institución-2024'!$W$1:$W$63000,'XX.Institución-2024'!$D$1:$D$63000,'Base Maestra'!$A9,'XX.Institución-2024'!$F$1:$F$63000,'Base Maestra'!I$4,'XX.Institución-2024'!$E$1:$E$63000,'Base Maestra'!$N9)","v":0},{"$f":"SUMIFS('XX.Institución-2024'!$W$1:$W$63000,'XX.Institución-2024'!$D$1:$D$63000,'Base Maestra'!$A9,'XX.Institución-2024'!$F$1:$F$63000,'Base Maestra'!J$4,'XX.Institución-2024'!$E$1:$E$63000,'Base Maestra'!$N9)","v":0},{"$f":"SUMIFS('XX.Institución-2024'!$W$1:$W$63000,'XX.Institución-2024'!$D$1:$D$63000,'Base Maestra'!$A9,'XX.Institución-2024'!$F$1:$F$63000,'Base Maestra'!K$4,'XX.Institución-2024'!$E$1:$E$63000,'Base Maestra'!$N9)","v":0},{"$f":"SUMIFS('XX.Institución-2024'!$W$1:$W$63000,'XX.Institución-2024'!$D$1:$D$63000,'Base Maestra'!$A9,'XX.Institución-2024'!$F$1:$F$63000,'Base Maestra'!L$4,'XX.Institución-2024'!$E$1:$E$63000,'Base Maestra'!$N9)","v":0},0,"A01",null,4,0.2,0.8,80,null,33,"A08","Instituto Mexicano del Seguro Social (IMSS)"]
[38,"SEMAR","Secretaria de Marina",0,6161427.379999998,0,0,6161427.379999998,{"$f":"SUMIFS('XX.Institución-2024'!$W$1:$W$63000,'XX.Institución-2024'!$D$1:$D$63000,'Base Maestra'!$A10,'XX.Institución-2024'!$F$1:$F$63000,'Base Maestra'!I$4,'XX.Institución-2024'!$E$1:$E$63000,'Base Maestra'!$N10)","v":0},{"$f":"SUMIFS('XX.Institución-2024'!$W$1:$W$63000,'XX.Institución-2024'!$D$1:$D$63000,'Base Maestra'!$A10,'XX.Institución-2024'!$F$1:$F$63000,'Base Maestra'!J$4,'XX.Institución-2024'!$E$1:$E$63000,'Base Maestra'!$N10)","v":0},{"$f":"SUMIFS('XX.Institución-2024'!$W$1:$W$63000,'XX.Institución-2024'!$D$1:$D$63000,'Base Maestra'!$A10,'XX.Institución-2024'!$F$1:$F$63000,'Base Maestra'!K$4,'XX.Institución-2024'!$E$1:$E$63000,'Base Maestra'!$N10)","v":0},{"$f":"SUMIFS('XX.Institución-2024'!$W$1:$W$63000,'XX.Institución-2024'!$D$1:$D$63000,'Base Maestra'!$A10,'XX.Institución-2024'!$F$1:$F$63000,'Base Maestra'!L$4,'XX.Institución-2024'!$E$1:$E$63000,'Base Maestra'!$N10)","v":0},0,"A03",null,5,0.25,0.75,75,null,35,"A09","Petróleos Mexicanos (PEMEX)"]
{"$rows_left_out":510}
{"sheet":"Instructivo","index":1,"n_rows":112,"n_cols":10,"rows_kept":112,"cut":false,"hidden":false,"merged":[[111,1,111,14],[63,9,63,12],[64,9,64,12],[83,2,83,14],[85,2,85,14],[88,3,88,5],[98,3,98,14],[99,3,99,14],[100,3,100,14],[101,3,101,14],[104,3,104,5],[109,3,109,5],[65,9,65,12],[66,9,66,12],[67,9,67,12],[68,9,68,12],[62,9,62,12],[27,1,27,14],[29,1,29,14],[31,1,31,14],[32,2,32,14],[33,2,33,14],[35,1,35,14],[37,1,37,14],[55,1,55,14],[57,2,57,14],[60,9,60,12],[61,9,61,12],[25,1,25,14],[6,1,6,14],[10,1,10,14],[13,2,13,14],[14,2,14,14],[15,2,15,14],[16,2,16,14],[17,2,17,14],[19,1,19,14],[21,1,21,14],[22,1,22,14],[23,1,23,14]]}
[]
[null,null,null,null,null,null,"Subsecretaria de Políticas de Salud y Bienestar Poblacional"]
[null,null,null,null,null,null,"Dirección General de Información en Salud"]
[null,null,null,null,null,null,"Subsistema de Cuentas en Salud a Nivel Federal y Estatal (SICUENTAS)"]
[null,null,null,null,null,null,"INSTRUCTIVO DE LLENADO"]
[]
[null,"Este formato tiene como objetivo recopilar información detallada sobre el gasto en salud realizado durante el ejercicio 2024 por los diferentes tipos de establecimientos (hospitales, centros de salud, etc.) y unidades administrativas centrales (direcciones de planeación, finanzas, recursos humanos, etc.). La información se registrará utilizando los clasificadores de la administración pública: el Clasificador por Actividad Institucional (CAI) y el Clasificador por Objeto del Gasto (COG). Adicionalmente, el gasto se codificará según el clasificador de la Organización Mundial de la Salud (OMS) de Funciones de Atención (HC/CFA)."]
[]
[null,"Estructura del Formato:"]
[]
{"$rows_left_out":103}
{"sheet":"Resumen de Calidad","index":2,"n_rows":54,"n_cols":8,"rows_kept":54,"cut":false,"hidden":false,"merged":[]}
[]
[null,null,"Subsecretaria de Políticas de Salud y Bienestar Poblacional"]
[null,null,"Dirección General de Información en Salud"]
[null,null,"Subsistema de Cuentas en Salud a Nivel Federal y Estatal (SICUENTAS)"]
[null,null,{"$f":"IF(B10=\"\", \"\",\nIF(OR(B10=33,B10=34,B10=35,B10=36,B10=39), \"Instituciones de Seguridad Social\",\nIF(OR(B10=37,B10=38), \"Fuerzas Armadas\",\nIF(OR(B10=40,B10=41,B10=42,B10=43,B10=44,B10=45,B10=46,B10=47), \"Instituciones de Seguridad Social Estatales (ISSES)\", \"\"))))","v":""}]
[]
[null,null,"Semáforo de Calidad"]
[]
[null,"CVE_Proveedor ","Entidad Federativa","Cobertura Oportuna","Validez","Integridad","Consistencia","Calificación"]
[null,{"$f":"IF('XX.Institución-2024'!D2=\"\",\"\",'XX.Institución-2024'!D2)","v":""},{"$f":"IFERROR(VLOOKUP($B$10,'Base Maestra'!$A$5:$C$21,3,FALSE),\"\")","v":""},{"$f":"IF(IF(ISNUMBER(F16)*ISNUMBER(F24),(F16+F24)/2,IF(ISNUMBER(F16),F16/2,IF(ISNUMBER(F24),F24/2,\"\")))=0,\"\",IF(ISNUMBER(F16)*ISNUMBER(F24),(F16+F24)/2,IF(ISNUMBER(F16),F16/2,IF(ISNUMBER(F24),F24/2,\"\"))))","v":""},{"$f":"IF(F33=0,\"\",F33)","v":""},{"$f":"IF(F44=0,\"\",F44)","v":""},{"$f":"IF(F54=0,\"\",F54)","v":""},{"$f":"IFERROR(IF(AVERAGE(D10:G10)=0,\"\",AVERAGE(D10:G10)),\"\")","v":""}]
{"$rows_left_out":45}
{"sheet":"XX.Institución-2024","index":3,"n_rows":2,"n_cols":26,"rows_kept":2,"cut":false,"hidden":false,"merged":[]}
["Año","Cve_Entidad Federativa","Cve_Proveedor","Cve_Ins","Cve_FF","Cve_Subfunción","Cve_AI","Cve_H","Actividad Institucional","Cve_PP","Programa Presupuestario","Cve_PI","Programa Institucional","Cve_Capítulo ","Cve_Concepto ","Cve_Partida genérica ó partida específica","CLUES/CLAVE","Nombre de unidad","Cve_Función","Cve_Subf","Cve_Actividad","Cve_Subactividad","Importe/Ejercido ","Estructura COG","Estructura CAI","Estrcutura CFA"]
[null,null,null,null,null,null,null,null,null,null,null,null,null,null,null,null,null,null,null,null,null,null,null,{"$f":"IF(W2<>\"\",(IF(COUNTIFS('Base Maestra'!$A$26:$A$519,N2,'Base Maestra'!$B$26:$B$519,O2,'Base Maestra'!$C$26:$C$519,P2)>0,\"Correcto\",\"Revisar Catálogo\")),\"\")","v":""},{"$f":"IF(W2<>\"\",(IF(OR(E2=\"A09\",E2=\"A04\",E2=\"A01\",E2=\"A03\",E2=\"A10\",E2=\"A11\",D2=98,D2=99),\nIF(COUNTIFS('Base Maestra'!$F$69:$F$178,F2,\n'Base Maestra'!$G$69:$G$178,G2,\n'Base Maestra'!$H$69:$H$178,H2,\n'Base Maestra'!$I$69:$I$178,I2)>0,\n\"Correcto\",\"Revisar Catálogo\"),\n IF(E2=\"A08\",\n    IF(COUNTIFS('Base Maestra'!$F$181:$F$193,F2,\n                          'Base Maestra'!$G$181:$G$193,G2,\n                          'Base Maestra'!$I$181:$I$193,I2,\n                          'Base Maestra'!$J$181:$J$193,J2,\n                          'Base Maestra'!$K$181:$K$193,K2)>0,\n       \"Correcto\",\"Revisar Catálogo\"),\n IF(E2=\"A07\",\n    IF(COUNTIFS('Base Maestra'!$F$196:$F$208,F2,\n                          'Base Maestra'!$G$196:$G$208,G2,\n                          'Base Maestra'!$I$196:$I$208,I2,\n                          'Base Maestra'!$J$196:$J$208,J2,\n                          'Base Maestra'!$K$196:$K$208,K2)>0,\n       \"Correcto\",\"Revisar Catálogo\"),\n \"\")))),\"\")","v":""},{"$f":"IF(W2<>\"\",(IF(SUMPRODUCT(('Base Maestra'!$F$26:$F$65=S2)*('Base Maestra'!$G$26:$G$65=T2)*('Base Maestra'!$H$26:$H$65=U2)*('Base Maestra'!$I$26:$I$65=V2))>0,\"Correcto\",\"Revisar Catálogo\")),\"\")","v":""}]

{"sheet":"Notas 2025","index":4,"n_rows":24,"n_cols":8,"rows_kept":24,"cut":false,"hidden":false,"merged":[[20,4,20,6],[21,4,21,6],[14,1,14,7],[16,4,16,6],[17,4,17,6],[18,4,18,6],[19,4,19,6]]}
[]
[null,null,null,"Subsecretaria de Políticas de Salud y Bienestar Poblacional"]
[null,null,null,"Dirección General de Información en Salud"]
[null,null,null,"Subsistema de Cuentas en Salud a Nivel Federal y Estatal (SICUENTAS)"]
[]
[]
[]
[null,{"$f":"'Resumen de Calidad'!B10","v":""},{"$f":"'Resumen de Calidad'!C10","v":""},null,null,null,"Fecha de Recepción:"]
[]
[null,"Cve_FF","Descripción","Autorizado","Modificado","Ejercido","Autorizado 2026","Notas"]
{"$rows_left_out":15}
{"sheet":"1.Catálogo Espacio Temporal","index":5,"n_rows":37,"n_cols":15,"rows_kept":37,"cut":false,"hidden":false,"merged":[[11,12,13,14]]}
[]
[null,"1. Catálogo Espacio-Temporal de Institutuciones, Fuentes de Financiamiento, entidades federativas y tipos de unidad"]
[]
[null,"a) Institución",null,null,null,null,"b) Fuente de Financiamiento",null,null,"c) Entidad Federativa",null,null,"d) Claves para unidades sin CLUES"]
[null,"Cve_Proveedor","Cve_Ins","Nombre de unidad","Acrónimo ",null,"Cve_FF_VM ","Descripción",null,"Cve_Entidad Federativa","Descripción",null,"Tipo de Establecimiento","Nivel de atención","CLUES/CLAVE"]
[null,"ISS",33,"Instituto Mexicano del Seguro Social","IMSS",null,"A01","Ramo 07 (SEDENA)",null,1,"Aguascalientes",null,"Unidad Hospitalaria Especializada","Tercer Nivel de Atención","UTNA"]
[null,"ISS",34,"Instituto de Seguridad y Servicios Sociales de los Trabajadores del Estado","ISSSTE",null,"A03","Ramo 13 (SEMAR)",null,2,"Baja California",null,"Unidad Hospitalaria General","Segundo Nivel de Atención","USNA"]
[null,"ISS",35,"Petroleos Mexicanos","PEMEX",null,"A04","Ramo 19 (IMSS-BIENESTAR)",null,3,"Baja California Sur",null,"Unidad de Consulta Externa","Primer Nivel de Atención","UPNA"]
[null,"ISS",36,"Programa IMSS-Bienestar","IMSS-Bienestar",null,"A07","Instituto de Seguridad y Servicios Sociales de los Trabajadores del Estado (ISSSTE)",null,4,"Campeche",null,"Establecimiento de Apoyo (de tipología Oficinas Administrativas)","No aplica","UAC"]
[null,"ISS",39,"Instituto de Seguridad Social para las Fuerzas Armadas Mexicanas","ISSFAM",null,"A08","Instituto Mexicano del Seguro Social (IMSS)",null,5,"Coahuila",null,"Establecimiento de Apoyo","No aplica","UA"]
{"$rows_left_out":28}
{"sheet":"2.Catálgo CAI","index":6,"n_rows":176,"n_cols":10,"rows_kept":176,"cut":false,"hidden":false,"merged":[]}
[]
[null,"2. Estructura Programática Funcional del Instituto Mexicano del Seguro Social 2024"]
[]
[null,"Cve_Sub \nfunción","Cve_AI","Cve_H","Actividad Institucional","Cve_PP","Programa Presupuestario","Cve_PI","Programa Institucional","Indicador"]
[null,2,null,null,"Prestación de Servicios de Salud a la Persona"]
[null,null,2,null,"Servicios de apoyo administrativo"]
[null,2,2,null,"Servicios de apoyo administrativo","M001","Actividades de apoyo administrativo",null,null,"VR"]
[null,2,2,null,"Servicios de apoyo administrativo","W001","Operaciones ajenas",null,null,"VR"]
[null,null,3,null,"Eficacia en la atención médica preventiva"]
[null,2,3,null,"Eficacia en la atención médica preventiva","E001","Prevención y control de enfermedades",null,null,"VR"]
{"$rows_left_out":167}
{"sheet":"3.Catálogo COG","index":7,"n_rows":631,"n_cols":6,"rows_kept":631,"cut":false,"hidden":false,"merged":[]}
[]
[null,"3. Catálogo del Clasificador por Objeto de Gasto"]
[]
[null,"Cve_Capítulo ","Cve_Concepto ","Cve_Partida genérica ó partida específica","Descripción","Indicador "]
[null,1,null,null,"Gasto corriente"]
[null,1000,null,null,"Servicios Personales"]
[null,1000,1100,null,"Remuneraciones al personal de carácter permanente"]
[null,1000,1100,1110,"Dietas","VR"]
[null,1000,1100,1120,"Haberes","VR"]
[null,1000,1100,1130,"Sueldos base al personal permanente","VR"]
{"$rows_left_out":622}
{"sheet":"4.Equivalencias COG=CFA","index":8,"n_rows":97,"n_cols":7,"rows_kept":97,"cut":false,"hidden":false,"merged":[]}
[]
[null,"4. Catálogo de equivalencias COG=CFA, primer criterio (Gasto de Capital)"]
[]
[null,"Cve_Partida genérica ó partida específica","Descripción","Cve_Función","Cve_Subf","Cve_Actividad","Cve_Subactividad"]
[null,5110,"Muebles de oficina y estantería","HK.1","HK.1.1","HK.1.1.2","HK.1.1.2.4"]
[null,5120,"Muebles, excepto de oficina y estantería","HK.1","HK.1.1","HK.1.1.2","HK.1.1.2.4"]
[null,5130,"Bienes artísticos, culturales y científicos","HK.1","HK.1.1","HK.1.1.2","HK.1.1.2.4"]
[null,5140,"Objetos de valor","HK.1","HK.1.1","HK.1.1.2","HK.1.1.2.4"]
[null,5150,"Equipo de cómputo y de tecnologías de la información","HK.1","HK.1.1","HK.1.1.3","HK.1.1.3.1"]
[null,51901,"Equipo de administración","HK.1","HK.1.1","HK.1.1.2","HK.1.1.2.4"]
{"$rows_left_out":88}
{"sheet":"5.Equivalencias CAI=CFA","index":9,"n_rows":157,"n_cols":28,"rows_kept":157,"cut":false,"hidden":false,"merged":[[48,1,156,1],[5,1,22,1],[46,24,46,27],[25,8,25,11],[25,12,25,15],[25,16,25,19],[25,20,25,23],[46,8,46,11],[46,12,46,15],[46,16,46,19],[46,20,46,23],[25,24,25,27],[27,1,43,1],[3,8,3,11],[3,12,3,15],[3,16,3,19],[3,20,3,23],[3,24,3,27]]}
[]
[null,"5. Catálogo de equivalencias COG=CFA, segundo criterio (Gasto Corriente y tipo de unidad)"]
[]
[null,null,null,null,null,null,null,null,"De hospitalización General ",null,null,null,"Hospitales Especializados (tercer nivel)",null,null,null,"De Consulta Externa",null,null,null,"Unidades administrativas/Delegaciones",null,null,null,"Establecimientos de apoyo"]
[null,null,"Cve_Subfunción","Cve_AI","Cve_H","Actividad Institucional","Cve_PP","Programa Presupuestario","Cve_Función","Cve_Subf","Cve_Actividad","Cve_Subactividad","Cve_Función","Cve_Subf","Cve_Actividad","Cve_Subactividad","Cve_Función","Cve_Subf","Cve_Actividad","Cve_Subactividad","Cve_Función","Cve_Subf","Cve_Actividad","Cve_Subactividad","Cve_Función","Cve_Subf","Cve_Actividad","Cve_Subactividad"]
[null,"Estructura Funcional del IMSS",2,null,null,"Prestación de Servicios de Salud a la Persona",null,"Prestación de Servicios de Salud a la Persona"]
[null,null,null,2,null,"Servicios de apoyo administrativo",null,"Servicios de apoyo administrativo"]
[null,null,2,2,null,"Servicios de apoyo administrativo","M001","Actividades de apoyo administrativo","HC.1","HC.1.1","HC.1.1.1",null,"HC.1","HC.1.1","HC.1.1.2",null,"HC.1","HC.1.3","HC.1.3.1",null,"HC.7","HC.7.1",null,null,"HC.9"]
[null,null,2,2,null,"Servicios de apoyo administrativo","W001","Operaciones ajenas","HC.1","HC.1.1","HC.1.1.1",null,"HC.1","HC.1.1","HC.1.1.2",null,"HC.1","HC.1.3","HC.1.3.1",null,"HC.7","HC.7.1",null,null,"HC.9"]
[null,null,null,3,null,"Eficacia en la atención médica preventiva",null,"Eficacia en la atención médica preventiva"]
{"$rows_left_out":147}